Reaction Details
TargetNeuraminidase
LigandBDBM4723
Substrate/CompetitorBDBM4702
Meas. Tech.Neuraminidase Inhibition Assay
pH6.5±n/a
Temperature310.15±n/a K
IC50 10000±n/a nM
Citation Chand, PKotian, PLMorris, PEBantia, SWalsh, DABabu, YS Synthesis and inhibitory activity of benzoic acid and pyridine derivatives on influenza neuraminidase. Bioorg Med Chem13:2665-78 (2005) 
 
Neuraminidase
Name:Neuraminidase
Type:Enzyme
Mol. Mass.:52468.81
Organism:Influenza A virus (N9)
Description:P03472
Residue:470
BDBM4723
BDBM4702
NameBDBM4723
Synonyms:3,5-dicarbamimidamido-4-acetamidobenzoic acid Benzoic Acid deriv. 6b | CHEMBL56314
TypeSmall organic molecule
Emp. Form.C11H15N7O3
Mol. Mass.293.2819
SMILES[#6]-[#6](=O)-[#7]-c1c(cc(cc1\[#7]=[#6](/[#7])-[#7])-[#6](-[#8])=O)\[#7]=[#6](/[#7])-[#7]