Reaction Details
TargetLeucine-rich repeat serine/threonine-protein kinase 2
LigandBDBM128249
Substrate/Competitorn/a
Meas. Tech.Lanthascreen Binding Assay
Ki 2±n/a nM
Citation Baker-Glenn, CChambers, MChan, BKEstrada, ASweeney, ZK Aminopyrimidine derivatives as LRRK2 modulators US Patent US8796296 Publication Date 8/5/2014
 
Leucine-rich repeat serine/threonine-protein kinase 2
Name:Leucine-rich repeat serine/threonine-protein kinase 2
Type:Protein
Mol. Mass.:286113.20
Organism:Homo sapiens (Human)
Description:Q5S007
Residue:2527
BDBM128249
NameBDBM128249
Synonyms:US8796296, 4
TypeSmall organic molecule
Emp. Form.C15H14ClF3N6O
Mol. Mass.386.759
SMILESCNc1nc(Nc2cc3n(C)c(=O)n(C)c3cc2Cl)ncc1C(F)(F)F