Reaction Details
TargetAdenosine receptor A2a
LigandBDBM128298
Substrate/Competitorn/a
Meas. Tech.Competition Radioligand Binding Assay
Temperature298.15±n/a K
Ki 14±n/a nM
Commentsextracted
Citation Camacho Gomez, JACastro-Palomino Laria, JC 4-aminopyrimidine derivatives and their as as adenosine A2a receptor antagonists US Patent US8796284 Publication Date 8/5/2014
 
Adenosine receptor A2a
Name:Adenosine receptor A2a
Type:G Protein-Coupled Receptor (GPCR)
Mol. Mass.:44716.46
Organism:Homo sapiens (Human)
Description:P29274
Residue:412
BDBM128298
NameBDBM128298
Synonyms:US8796284, 5
TypeSmall organic molecule
Emp. Form.C12H15BrN6
Mol. Mass.323.192
SMILESNc1nc(nc(N2CCCCC2)c1Br)-n1cccn1