Reaction Details
TargetAdenosine receptor A2a
LigandBDBM128309
Substrate/Competitorn/a
Meas. Tech.Competition Radioligand Binding Assay
Temperature298.15±n/a K
Ki 17±n/a nM
Commentsextracted
Citation Camacho Gomez, JACastro-Palomino Laria, JC 4-aminopyrimidine derivatives and their as as adenosine A2a receptor antagonists US Patent US8796284 Publication Date 8/5/2014
 
Adenosine receptor A2a
Name:Adenosine receptor A2a
Type:G Protein-Coupled Receptor (GPCR)
Mol. Mass.:44716.46
Organism:Homo sapiens (Human)
Description:P29274
Residue:412
BDBM128309
NameBDBM128309
Synonyms:US8796284, 46
TypeSmall organic molecule
Emp. Form.C10H8ClN7
Mol. Mass.261.67
SMILESNc1nc(nc(c1Cl)-n1cccn1)-n1cccn1