Reaction Details
TargetFatty acid synthase
LigandBDBM128367
Substrate/Competitorn/a
Meas. Tech.Biological Assay
pH7±n/a
IC50 398±n/a nM
Commentsextracted
Citation Adams, NDAquino, CJChaudhari, AMGhergurovich, JMKiesow, TJParrish, CAReif, AJWiggall, K Triazolones as fatty acid synthase inhibitors US Patent US8802864 Publication Date 8/12/2014
 
Fatty acid synthase
Name:Fatty acid synthase
Type:Enzyme
Mol. Mass.:273419.37
Organism:Homo sapiens (Human)
Description:P49327
Residue:2511
BDBM128367
NameBDBM128367
Synonyms:US8802864, 158
TypeSmall organic molecule
Emp. Form.C25H26FN5O3
Mol. Mass.463.504
SMILESCC(=O)Nc1ccc(cc1)-c1ccc(c(F)c1)-n1c(C[C@@H]2CCN(C2)C(=O)C2CC2)n[nH]c1=O