Reaction Details
TargetMitogen-activated protein kinase kinase kinase 5
LigandBDBM128402
Substrate/Competitorn/a
Meas. Tech.Scintillation Assay
pH7.5±n/a
Temperature298.15±n/a K
IC50 14±n/a nM
Commentsextracted
Citation Chang, E Apoptosis signal-regulating kinase 1 inhibitors US Patent US8802695 Publication Date 8/12/2014
 
Mitogen-activated protein kinase kinase kinase 5
Name:Mitogen-activated protein kinase kinase kinase 5
Type:Protein
Mol. Mass.:154514.93
Organism:Homo sapiens (Human)
Description:Q99683
Residue:1374
BDBM128402
NameBDBM128402
Synonyms:US8802695, 18
TypeSmall organic molecule
Emp. Form.C20H23N3O3
Mol. Mass.353.4149
SMILESCCn1cc(C)c2cnc(NC(=O)c3ccc(cc3)[C@@](C)(O)CO)cc12