Reaction Details
TargetGag-Pol polyprotein
LigandBDBM128417
Substrate/Competitorn/a
Meas. Tech.Enzyme Inhibition Assay
Ki 0.014±n/a nM
Citation Ghosh, AKMartyr, CD Processes and intermediates for preparing substituted hexahydrofuro [2,3-b] furans US Patent US8802724 Publication Date 8/12/2014
 
Gag-Pol polyprotein
Name:Gag-Pol polyprotein
Type:Protein
Mol. Mass.:163312.58
Organism:Human immunodeficiency virus type 1 (HIV-1)
Description:P03367
Residue:1447
BDBM128417
NameBDBM128417
Synonyms:US8802724, 3a
TypeSmall organic molecule
Emp. Form.C28H38N2O8S
Mol. Mass.562.675
SMILESCOc1ccc(cc1)S(=O)(=O)N(CC(C)C)CC(O)C(Cc1ccccc1)NC(=O)OC1COC2OCCC12