Reaction Details
TargetFibroblast growth factor receptor 3
LigandBDBM128474
Substrate/Competitorn/a
Meas. Tech.In Vitro Kinase Inhibition Assay
pH8±n/a
Temperature298.15±n/a K
IC50 0.675±n/a nM
Commentsextracted
Citation Berdini, VCarr, MGCongreve, MSFrederickson, MGriffiths-Jones, CMHamlett, CCMadin, AMurray, CWBenning, RKSaxty, GVickerstaffe, EWilliams, BJWoodhead, AJWoodhead, SJFreyne, EJGovaerts, TCAngibaud, PR Imidazopyridine derivatives as inhibitors of receptor tyrosine kinases US Patent US8796244 Publication Date 8/5/2014
 
Fibroblast growth factor receptor 3
Name:Fibroblast growth factor receptor 3
Type:Protein
Mol. Mass.:87699.57
Organism:Homo sapiens (Human)
Description:P22607
Residue:806
BDBM128474
NameBDBM128474
Synonyms:US8796244, 53
TypeSmall organic molecule
Emp. Form.C22H19F3N6OS
Mol. Mass.472.486
SMILESFC(F)(F)CNC(=O)Nc1cccc(c1)-c1cnc2cc(ccn12)-c1nc2CCNCc2s1