Reaction Details
TargetFibroblast growth factor receptor 3
LigandBDBM128491
Substrate/Competitorn/a
Meas. Tech.In Vitro Kinase Inhibition Assay
pH8±n/a
Temperature298.15±n/a K
IC50 0.74±n/a nM
Commentsextracted
Citation Berdini, VCarr, MGCongreve, MSFrederickson, MGriffiths-Jones, CMHamlett, CCMadin, AMurray, CWBenning, RKSaxty, GVickerstaffe, EWilliams, BJWoodhead, AJWoodhead, SJFreyne, EJGovaerts, TCAngibaud, PR Imidazopyridine derivatives as inhibitors of receptor tyrosine kinases US Patent US8796244 Publication Date 8/5/2014
 
Fibroblast growth factor receptor 3
Name:Fibroblast growth factor receptor 3
Type:Protein
Mol. Mass.:87699.57
Organism:Homo sapiens (Human)
Description:P22607
Residue:806
BDBM128491
NameBDBM128491
Synonyms:US8796244, 70
TypeSmall organic molecule
Emp. Form.C25H28F3N7O2
Mol. Mass.515.5307
SMILESCN(C)C(=O)C(C)(C)N=CC(C=N)c1ccn2c(cnc2c1)-c1cccc(NC(=O)NCC(F)(F)F)c1