Reaction Details
TargetFibroblast growth factor receptor 3
LigandBDBM128616
Substrate/Competitorn/a
Meas. Tech.In Vitro Kinase Inhibition Assay
pH8±n/a
Temperature298.15±n/a K
IC50 0.99±n/a nM
Commentsextracted
Citation Berdini, VCarr, MGCongreve, MSFrederickson, MGriffiths-Jones, CMHamlett, CCMadin, AMurray, CWBenning, RKSaxty, GVickerstaffe, EWilliams, BJWoodhead, AJWoodhead, SJFreyne, EJGovaerts, TCAngibaud, PR Imidazopyridine derivatives as inhibitors of receptor tyrosine kinases US Patent US8796244 Publication Date 8/5/2014
 
Fibroblast growth factor receptor 3
Name:Fibroblast growth factor receptor 3
Type:Protein
Mol. Mass.:87699.57
Organism:Homo sapiens (Human)
Description:P22607
Residue:806
BDBM128616
NameBDBM128616
Synonyms:US8796244, 204
TypeSmall organic molecule
Emp. Form.C22H18F3N5O2
Mol. Mass.441.4058
SMILESCOc1ccc(nc1)-c1ccn2c(cnc2c1)-c1cccc(NC(=O)NCC(F)(F)F)c1