Reaction Details
TargetFibroblast growth factor receptor 3
LigandBDBM128740
Substrate/Competitorn/a
Meas. Tech.In Vitro Kinase Inhibition Assay
pH8±n/a
Temperature298.15±n/a K
IC50 0.99±n/a nM
Commentsextracted
Citation Berdini, VCarr, MGCongreve, MSFrederickson, MGriffiths-Jones, CMHamlett, CCMadin, AMurray, CWBenning, RKSaxty, GVickerstaffe, EWilliams, BJWoodhead, AJWoodhead, SJFreyne, EJGovaerts, TCAngibaud, PR Imidazopyridine derivatives as inhibitors of receptor tyrosine kinases US Patent US8796244 Publication Date 8/5/2014
 
Fibroblast growth factor receptor 3
Name:Fibroblast growth factor receptor 3
Type:Protein
Mol. Mass.:87699.57
Organism:Homo sapiens (Human)
Description:P22607
Residue:806
BDBM128740
NameBDBM128740
Synonyms:US8796244, 335
TypeSmall organic molecule
Emp. Form.C22H20F3N7O2
Mol. Mass.471.4351
SMILESCOCc1cc(nc(N)n1)-c1ccn2c(cnc2c1)-c1cccc(NC(=O)NCC(F)(F)F)c1