Reaction Details
TargetTransient receptor potential cation channel subfamily V member 1
LigandBDBM128837
Substrate/Competitorn/a
Meas. Tech.FLIPR Assay
IC50 4±n/a nM
Citation Gomtsyan, ADaanen, JFGfesser, GAKort, MELee, CMcDonald, HAPuttfarcken, PSVoight, EAKym, PR TRPV1 antagonists US Patent US8802711 Publication Date 8/12/2014
 
Transient receptor potential cation channel subfamily V member 1
Name:Transient receptor potential cation channel subfamily V member 1
Type:Protein
Mol. Mass.:94960.75
Organism:Homo sapiens (Human)
Description:Q8NER1
Residue:839
BDBM128837
NameBDBM128837
Synonyms:US8802711, 6
TypeSmall organic molecule
Emp. Form.C22H22FN3O
Mol. Mass.363.428
SMILESCc1cc2c(NC(=O)N[C@@H]3CC[C@@H](C3)c3ccccc3)c(F)ccc2cn1