Reaction Details
TargetMembrane primary amine oxidase
LigandBDBM129000
Substrate/Competitorn/a
Meas. Tech.Inhibition Assay
Temperature298.15±n/a K
IC50 11±n/a nM
Commentsextracted
Citation Yoshihara, KSuzuki, DYamaki, SKoga, YSeki, NFujiyasu, JNeya, M Glycine compound US Patent US8802679 Publication Date 8/12/2014
 
Membrane primary amine oxidase
Name:Membrane primary amine oxidase
Type:Protein
Mol. Mass.:84620.86
Organism:Homo sapiens (Human)
Description:Q16853
Residue:763
BDBM129000
NameBDBM129000
Synonyms:US8802679, 95
TypeSmall organic molecule
Emp. Form.C21H22N6O
Mol. Mass.374.439
SMILESCN(Cc1cccc(c1)-c1cnc(nc1)N1Cc2cccnc2C1)C(=O)CN