Reaction Details
TargetLeucine-rich repeat serine/threonine-protein kinase 2
LigandBDBM129033
Substrate/Competitorn/a
Meas. Tech.LabChip Assay
Ki 2.3±n/a nM
Citation Baker-Glenn, CBurdick, DJChambers, MChan, BKChen, HEstrada, AGunzner-Tate, JShore, DSweeney, ZKWang, SZhao, G Aminopyrimidine derivatives as LRRK2 modulators US Patent US8802674 Publication Date 8/12/2014
 
Leucine-rich repeat serine/threonine-protein kinase 2
Name:Leucine-rich repeat serine/threonine-protein kinase 2
Type:Protein
Mol. Mass.:286113.20
Organism:Homo sapiens (Human)
Description:Q5S007
Residue:2527
BDBM129033
NameBDBM129033
Synonyms:US8802674, 65
TypeSmall organic molecule
Emp. Form.C16H21ClN6O2
Mol. Mass.364.83
SMILESCNc1nc(Nc2ccc(cc2OC)C(=O)NCCCN)ncc1Cl