Reaction Details
TargetLeucine-rich repeat serine/threonine-protein kinase 2
LigandBDBM129056
Substrate/Competitorn/a
Meas. Tech.LabChip Assay
Ki 2.1±n/a nM
Citation Baker-Glenn, CBurdick, DJChambers, MChan, BKChen, HEstrada, AGunzner-Tate, JShore, DSweeney, ZKWang, SZhao, G Aminopyrimidine derivatives as LRRK2 modulators US Patent US8802674 Publication Date 8/12/2014
 
Leucine-rich repeat serine/threonine-protein kinase 2
Name:Leucine-rich repeat serine/threonine-protein kinase 2
Type:Protein
Mol. Mass.:286113.20
Organism:Homo sapiens (Human)
Description:Q5S007
Residue:2527
BDBM129056
NameBDBM129056
Synonyms:US8802674, 101
TypeSmall organic molecule
Emp. Form.C17H19IN4O4
Mol. Mass.470.2616
SMILESCOc1cc(ccc1Nc1ncc(I)c(OC)n1)C(=O)N1CCOCC1