Reaction Details
TargetTrace amine-associated receptor 1
LigandBDBM129404
Substrate/Competitorn/a
Meas. Tech.Radioligand Binding
pH7.4±n/a
Temperature310.15±n/a K
Ki 0.8±n/a nM
Commentsextracted
Citation Galley, GNorcross, RDPflieger, P Heterocyclic amine derivatives US Patent US8802673 Publication Date 8/12/2014
 
Trace amine-associated receptor 1
Name:Trace amine-associated receptor 1
Type:Protein
Mol. Mass.:37635.41
Organism:Mus musculus (Mouse)
Description:Q923Y8
Residue:332
BDBM129404
NameBDBM129404
Synonyms:US8802673, 46
TypeSmall organic molecule
Emp. Form.C19H19N3O
Mol. Mass.305.3737
SMILESC1CO[C@H](CN1)c1ccc(Nc2ccc3ccccc3n2)cc1