Reaction Details
TargetTrace amine-associated receptor 1
LigandBDBM129505
Substrate/Competitorn/a
Meas. Tech.Radioligand Binding
pH7.4±n/a
Temperature310.15±n/a K
Ki 0.9±n/a nM
Commentsextracted
Citation Galley, GNorcross, RDPflieger, P Heterocyclic amine derivatives US Patent US8802673 Publication Date 8/12/2014
 
Trace amine-associated receptor 1
Name:Trace amine-associated receptor 1
Type:Protein
Mol. Mass.:37635.41
Organism:Mus musculus (Mouse)
Description:Q923Y8
Residue:332
BDBM129505
NameBDBM129505
Synonyms:US8802673, 147
TypeSmall organic molecule
Emp. Form.C18H18N4O2
Mol. Mass.322.3611
SMILESC1CO[C@H](CN1)c1ccc(Nc2ncc(cn2)-c2ccco2)cc1