Reaction Details
TargetTrace amine-associated receptor 1
LigandBDBM129529
Substrate/Competitorn/a
Meas. Tech.Radioligand Binding
pH7.4±n/a
Temperature310.15±n/a K
Ki 0.8±n/a nM
Commentsextracted
Citation Galley, GNorcross, RDPflieger, P Heterocyclic amine derivatives US Patent US8802673 Publication Date 8/12/2014
 
Trace amine-associated receptor 1
Name:Trace amine-associated receptor 1
Type:Protein
Mol. Mass.:37635.41
Organism:Mus musculus (Mouse)
Description:Q923Y8
Residue:332
BDBM129529
NameBDBM129529
Synonyms:US8802673, 171
TypeSmall organic molecule
Emp. Form.C17H19ClN4O
Mol. Mass.330.812
SMILESClc1cc(ccc1Nc1ncc(cn1)C1CC1)[C@H]1CNCCO1