Reaction Details
TargetTrace amine-associated receptor 1
LigandBDBM129549
Substrate/Competitorn/a
Meas. Tech.Radioligand Binding
pH7.4±n/a
Temperature310.15±n/a K
Ki 1±n/a nM
Commentsextracted
Citation Galley, GNorcross, RDPflieger, P Heterocyclic amine derivatives US Patent US8802673 Publication Date 8/12/2014
 
Trace amine-associated receptor 1
Name:Trace amine-associated receptor 1
Type:Protein
Mol. Mass.:37635.41
Organism:Mus musculus (Mouse)
Description:Q923Y8
Residue:332
BDBM129549
NameBDBM129549
Synonyms:US8802673, 191
TypeSmall organic molecule
Emp. Form.C16H17F5N2OS
Mol. Mass.380.376
SMILESFS(F)(F)(F)(F)c1ccc(Nc2ccc(cc2)[C@@H]2CNCCO2)cc1