Reaction Details
TargetSphingosine 1-phosphate receptor 1
LigandBDBM129584
Substrate/Competitorn/a
Meas. Tech.Receptor Binding Assay
pH7.4±n/a
Temperature277.15±n/a K
Ki 0.7±n/a nM
Commentsextracted
Citation Quattropani, ABaker-Glenn, CBlackaby, WKnight, C Pyrazole oxadiazole derivatives as S1P1 agonists US Patent US8802663 Publication Date 8/12/2014
 
Sphingosine 1-phosphate receptor 1
Name:Sphingosine 1-phosphate receptor 1
Type:Enzyme
Mol. Mass.:42836.02
Organism:Homo sapiens (Human)
Description:P21453
Residue:382
BDBM129584
NameBDBM129584
Synonyms:US8802663, 97
TypeSmall organic molecule
Emp. Form.C27H33N5O4
Mol. Mass.491.582
SMILESOC(=O)C1CN(Cc2ccc(cc2)-c2noc(n2)-c2cnn(C3CCCCC3)c2C2CCOCC2)C1