Reaction Details
TargetMuscarinic acetylcholine receptor M3
LigandBDBM103823
Substrate/Competitorn/a
Meas. Tech.Radioligand Binding Assay
Ki 0.1±n/a nM
Citation Hughes, ADChen, YJacobsen, JRStangeland, ELYen, R Diamide compounds having muscarinic receptor antagonist and β2 adrenergic receptor agonist activity US Patent US8816088 Publication Date 8/26/2014
 
Muscarinic acetylcholine receptor M3
Name:Muscarinic acetylcholine receptor M3
Type:Enzyme
Mol. Mass.:66151.03
Organism:Homo sapiens (Human)
Description:P20309
Residue:590
BDBM103823
NameBDBM103823
Synonyms:US8551978, I-94 US9394275, I-94 US9682957, I-94
TypeSmall organic molecule
Emp. Form.C52H58N6O8
Mol. Mass.895.0523
SMILESCOc1ccc(CC(C)NC[C@H](O)c2ccc(O)c3[nH]c(=O)ccc23)cc1CC(=O)NCc1ccc(cc1)N(C)C(=O)CCN1CCC(CC1)OC(=O)Nc1ccccc1-c1ccccc1