Reaction Details
TargetEstrogen receptor
LigandBDBM129630
Substrate/Competitorn/a
Meas. Tech.Binding Assay
Temperature277.15±n/a K
IC50 28±n/a nM
Commentsextracted
Citation Pickar, JHKomm, BS 2-Phenyl-1-[4-(2-Aminoethoxy)-Benzyl]-Indole and estrogen formulations US Patent US8815934 Publication Date 8/26/2014
 
Estrogen receptor
Name:Estrogen receptor
Type:Protein
Mol. Mass.:66230.44
Organism:Homo sapiens (Human)
Description:P03372
Residue:595
BDBM129630
NameBDBM129630
Synonyms:US8815934, No. 105
TypeSmall organic molecule
Emp. Form.C29H34N2O3
Mol. Mass.458.5919
SMILESCCCCN(C)CCOc1ccc(Cn2c(c(C)c3cc(O)ccc23)-c2ccc(O)cc2)cc1