Reaction Details
TargetEstrogen receptor
LigandBDBM129655
Substrate/Competitorn/a
Meas. Tech.Binding Assay
Temperature277.15±n/a K
IC50 23±n/a nM
Commentsextracted
Citation Pickar, JHKomm, BS 2-Phenyl-1-[4-(2-Aminoethoxy)-Benzyl]-Indole and estrogen formulations US Patent US8815934 Publication Date 8/26/2014
 
Estrogen receptor
Name:Estrogen receptor
Type:Protein
Mol. Mass.:66230.44
Organism:Homo sapiens (Human)
Description:P03372
Residue:595
BDBM129655
NameBDBM129655
Synonyms:US8815934, No. 139
TypeSmall organic molecule
Emp. Form.C30H31N3O3
Mol. Mass.481.5854
SMILESOc1ccc(cc1)-c1c(C#N)c2cc(O)ccc2n1Cc1ccc(OCCN2CCCCCC2)cc1