Reaction Details
TargetE3 ubiquitin-protein ligase Mdm2
LigandBDBM129945
Substrate/Competitorn/a
Meas. Tech.Time Resolved Fluorescence Energy Transfer (TR-FRET) Assay
IC50 0.08±n/a nM
Citation Furet, PGuagnano, VHolzer, PKallen, JLiao, LMah, RMao, LMasuya, KSchlapbach, AStutz, SVaupel, A Substituted pyrrolo[3,4-D]imidazoles for the treatment of MDM2/4 mediated diseases US Patent US8815926 Publication Date 8/26/2014
 
E3 ubiquitin-protein ligase Mdm2
Name:E3 ubiquitin-protein ligase Mdm2
Type:Oncoprotein
Mol. Mass.:55196.54
Organism:Homo sapiens (Human)
Description:Q00987
Residue:491
BDBM129945
NameBDBM129945
Synonyms:US8815926, 226
TypeSmall organic molecule
Emp. Form.C33H34Cl2N4O3
Mol. Mass.605.554
SMILESCOc1ccc(cc1-c1nc2C(=O)N([C@H](c2n1C(C)C)c1ccc(Cl)cc1C)c1cc(Cl)ccc1C)C(=O)NC(C)C