Reaction Details
TargetE3 ubiquitin-protein ligase Mdm2
LigandBDBM130034
Substrate/Competitorn/a
Meas. Tech.Time Resolved Fluorescence Energy Transfer (TR-FRET) Assay
IC50 0.107±n/a nM
Citation Furet, PGuagnano, VHolzer, PKallen, JLiao, LMah, RMao, LMasuya, KSchlapbach, AStutz, SVaupel, A Substituted pyrrolo[3,4-D]imidazoles for the treatment of MDM2/4 mediated diseases US Patent US8815926 Publication Date 8/26/2014
 
E3 ubiquitin-protein ligase Mdm2
Name:E3 ubiquitin-protein ligase Mdm2
Type:Oncoprotein
Mol. Mass.:55196.54
Organism:Homo sapiens (Human)
Description:Q00987
Residue:491
BDBM130034
NameBDBM130034
Synonyms:US8815926, 316
TypeSmall organic molecule
Emp. Form.C26H22Cl2FN5O4
Mol. Mass.558.388
SMILESCOc1ncc(-c2nc3C(=O)N([C@H](c3n2[C@H](C)CO)c2ccc(Cl)cc2)c2cccc(Cl)c2F)c(OC)n1