Reaction Details
TargetE3 ubiquitin-protein ligase Mdm2
LigandBDBM130042
Substrate/Competitorn/a
Meas. Tech.Time Resolved Fluorescence Energy Transfer (TR-FRET) Assay
IC50 0.059±n/a nM
Citation Furet, PGuagnano, VHolzer, PKallen, JLiao, LMah, RMao, LMasuya, KSchlapbach, AStutz, SVaupel, A Substituted pyrrolo[3,4-D]imidazoles for the treatment of MDM2/4 mediated diseases US Patent US8815926 Publication Date 8/26/2014
 
E3 ubiquitin-protein ligase Mdm2
Name:E3 ubiquitin-protein ligase Mdm2
Type:Oncoprotein
Mol. Mass.:55196.54
Organism:Homo sapiens (Human)
Description:Q00987
Residue:491
BDBM130042
NameBDBM130042
Synonyms:US8815926, 325
TypeSmall organic molecule
Emp. Form.C28H29Cl2N7O4
Mol. Mass.598.48
SMILESCOC[C@@H](C)n1c(nc2C(=O)N([C@H](c12)c1ccc(Cl)cc1)c1cc(Cl)c(=O)n(C)c1)-c1cnc(nc1OC)N(C)C