Reaction Details
TargetBaculoviral IAP repeat-containing protein 3 [238-349]
LigandBDBM130050
Substrate/Competitorn/a
Meas. Tech.Fluorescence Polarization-Based Assays
IC50<20±n/a nM
Citation Wang, SSun, H Bivalent diazo bicyclic Smac mimetics and the uses thereof US Patent US8815927 Publication Date 8/26/2014
 
Baculoviral IAP repeat-containing protein 3 [238-349]
Name:Baculoviral IAP repeat-containing protein 3 [238-349]
Type:BIR3 domain
Mol. Mass.:12945.93
Organism:Homo sapiens (Human)
Description:Human cIAP2 BIR3 domain (residues 238-349) was used in binding assays.
Residue:112
BDBM130050
NameBDBM130050
Synonyms:US8815927, SM-1266
TypeSmall organic molecule
Emp. Form.C60H74N12O6
Mol. Mass.1059.3064
SMILESCN[C@@H](C)C(=O)N[C@H]1CN(CC[C@H]2CC[C@H](N2C1=O)c1nc2c(cccc2[nH]1)-c1ccccc1)C(=O)CCCCCCC(=O)N1CC[C@H]2CC[C@H](N2C(=O)[C@H](C1)NC(=O)[C@H](C)NC)c1nc2c(cccc2[nH]1)-c1ccccc1