Reaction Details
TargetFibroblast growth factor receptor 3
LigandBDBM102541
Substrate/Competitorn/a
Meas. Tech.LanthaScreen TR-FRET Assay
Temperature298.15±n/a K
IC50 32±n/a nM
Commentsextracted
Citation Furet, PGraus Porta, DGuagnano, V Quinoline carboxamide derivatives as protein tyrosine kinase inhibitors US Patent US8815901 Publication Date 8/26/2014
 
Fibroblast growth factor receptor 3
Name:Fibroblast growth factor receptor 3
Type:Protein
Mol. Mass.:87699.57
Organism:Homo sapiens (Human)
Description:P22607
Residue:806
BDBM102541
NameBDBM102541
Synonyms:US8536175, 152
TypeSmall organic molecule
Emp. Form.C27H25ClFN5O5S
Mol. Mass.586.034
SMILESCOc1cc(OC)c(Cl)c(c1F)-c1ccc(C(=O)Nc2ccc(CN3CCS(=O)(=O)CC3)cn2)c2nccnc12