Reaction Details
TargetMembrane metallo-endopeptidase-like 1
LigandBDBM130359
Substrate/Competitorn/a
Meas. Tech.Inhibition Assay
pH7.4±n/a
Temperature298.15±n/a K
IC50 0.7±n/a nM
Commentsextracted
Citation Iwaki, YKarki, RGKsander, GM Substituted aminopropionic derivatives as neprilysin inhibitors US Patent US8822534 Publication Date 9/2/2014
 
Membrane metallo-endopeptidase-like 1
Name:Membrane metallo-endopeptidase-like 1
Type:Enzyme
Mol. Mass.:89358.76
Organism:Homo sapiens (Human)
Description:Q495T6
Residue:779
BDBM130359
NameBDBM130359
Synonyms:US8822534, Example 5-39 | US8993631, 5-8
TypeSmall organic molecule
Emp. Form.C21H22ClNO6
Mol. Mass.419.855
SMILESCOc1ccc(Cl)cc1-c1ccc(C[C@H](CC(O)=O)NC(=O)CCC(O)=O)cc1