Reaction Details
TargetMembrane metallo-endopeptidase-like 1
LigandBDBM130367
Substrate/Competitorn/a
Meas. Tech.Inhibition Assay
pH7.4±n/a
Temperature298.15±n/a K
IC50 0.07±n/a nM
Commentsextracted
Citation Iwaki, YKarki, RGKsander, GM Substituted aminopropionic derivatives as neprilysin inhibitors US Patent US8822534 Publication Date 9/2/2014
 
Membrane metallo-endopeptidase-like 1
Name:Membrane metallo-endopeptidase-like 1
Type:Enzyme
Mol. Mass.:89358.76
Organism:Homo sapiens (Human)
Description:Q495T6
Residue:779
BDBM130367
NameBDBM130367
Synonyms:US8822534, Example 11-14
TypeSmall organic molecule
Emp. Form.C20H17ClN2O5
Mol. Mass.400.812
SMILESOC(=O)C[C@@H](Cc1ccc(cc1)-c1cccc(Cl)c1)NC(=O)c1cc(O)no1