Reaction Details
TargetEpstein-Barr nuclear antigen 1
LigandBDBM130376
Substrate/Competitorn/a
Meas. Tech.Nuclear Magnetic Resonance (NMR) Assay
pH8±n/a
IC50 4.0e+3± 1e+2 nM
Commentsextracted
Citation Gable, JELee, GMJaishankar, PHearn, BRWaddling, CARenslo, ARCraik, CS Broad-spectrum allosteric inhibition of herpesvirus proteases. Biochemistry53:4648-60 (2014) 
 
Epstein-Barr nuclear antigen 1
Name:Epstein-Barr nuclear antigen 1
Type:Enzyme Catalytic Domain
Mol. Mass.:56444.81
Organism:Human herpesvirus 4
Description:gi_23893623
Residue:641
BDBM130376
NameBDBM130376
Synonyms:N-[2-Benzyl-4-(1H-1,2,3,4-tetrazol-5-yl)phenyl]-6-(cyclohexylmethyl)pyridine-2- carboxamide (2)
TypeSmall organic molecule
Emp. Form.C27H28N6O
Mol. Mass.452.5508
SMILESO=C(Nc1ccc(cc1Cc1ccccc1)-c1nnn[nH]1)c1cccc(CC2CCCCC2)n1