Reaction Details
TargetArginase
LigandBDBM130378
Substrate/Competitorn/a
Meas. Tech.ITC
pH8.5±0
Kd 1.3e+3± 2e+2 nM
Citation Hai, YEdwards, JEVan Zandt, MCHoffmann, KFChristianson, DW Crystal Structure of Schistosoma mansoni Arginase, a Potential Drug Target for the Treatment of Schistosomiasis Biochemistry53:4671-4684 (2014) 
 
Arginase
Name:Arginase
Synonyms:Arginase (SmARG)
Type:Protein
Mol. Mass.:39912.83
Organism:Schistosoma mansoni (flatworms)
Description:Q6WVP6
Residue:364
BDBM130378
NameBDBM130378
Synonyms:2(S)-amino-6-boronohexanoic acid (ABH)
TypeSmall organic molecule
Emp. Form.C6H14BNO4
Mol. Mass.174.991
SMILESN[C@@H](CCCCB(O)O)C(O)=O