Reaction Details
TargetArginase
LigandBDBM130379
Substrate/Competitorn/a
Meas. Tech.ITC
pH8.5±0
Kd 1.3e+4± 4e+3 nM
Citation Hai, YEdwards, JEVan Zandt, MCHoffmann, KFChristianson, DW Crystal Structure of Schistosoma mansoni Arginase, a Potential Drug Target for the Treatment of Schistosomiasis Biochemistry53:4671-4684 (2014) 
 
Arginase
Name:Arginase
Synonyms:Arginase (SmARG)
Type:Protein
Mol. Mass.:39912.83
Organism:Schistosoma mansoni (flatworms)
Description:Q6WVP6
Residue:364
BDBM130379
NameBDBM130379
Synonyms:N-hydroxy-L-arginine (NOHA)
TypeSmall organic molecule
Emp. Form.C6H14N4O3
Mol. Mass.190.2004
SMILESNC(=N)NCCC[C@H](NO)C(O)=O