Reaction Details
TargetArginase
LigandBDBM50427900
Substrate/Competitorn/a
Meas. Tech.ITC
pH8.5±0
Kd 2.6e+2± 2e+1 nM
Citation Hai, YEdwards, JEVan Zandt, MCHoffmann, KFChristianson, DW Crystal Structure of Schistosoma mansoni Arginase, a Potential Drug Target for the Treatment of Schistosomiasis Biochemistry53:4671-4684 (2014) 
 
Arginase
Name:Arginase
Synonyms:Arginase (SmARG)
Type:Protein
Mol. Mass.:39912.83
Organism:Schistosoma mansoni (flatworms)
Description:Q6WVP6
Residue:364
BDBM50427900
NameBDBM50427900
TypeSmall organic molecule
Emp. Form.C13H27BN2O4
Mol. Mass.286.175
SMILESN[C@](CCCCB(O)O)(CCN1CCCCC1)C(O)=O