Reaction Details
TargetD(1A) dopamine receptor
LigandBDBM130479
Substrate/Competitorn/a
Meas. Tech.Receptor Binding Assay
Ki 5.09±n/a nM
Citation Davoren, JEDounay, ABEfremov, IVGray, DLMente, SRO'Neil, SVRogers, BNSubramanyam, CZhang, L Heteroaromatic compounds and their use as dopamine D1 ligands US Patent US8822494 Publication Date 9/2/2014
 
D(1A) dopamine receptor
Name:D(1A) dopamine receptor
Type:Enzyme
Mol. Mass.:49303.43
Organism:Homo sapiens (Human)
Description:P21728
Residue:446
BDBM130479
NameBDBM130479
Synonyms:US8822494, 25
TypeSmall organic molecule
Emp. Form.C21H17F2N5O
Mol. Mass.393.3894
SMILESCc1ncnc(N2CC(F)C2)c1-c1ccc(Oc2nccc3[nH]ccc23)cc1F