Reaction Details
TargetHigh affinity cGMP-specific 3',5'-cyclic phosphodiesterase 9A
LigandBDBM130498
Substrate/Competitorn/a
Meas. Tech.Inhibition Assay
pH7.5±n/a
IC50 38±n/a nM
Commentsextracted
Citation Hendrix, MBärfacker, LErb, CHafner, FHeckroth, HKarthaus, DTersteegen, Avan der Staay, Fvan Kampen, M 6-cyclylmethyl-and 6-alkylmethyl-substituted pyrazolepyrimidines US Patent US8822479 Publication Date 9/2/2014
 
High affinity cGMP-specific 3',5'-cyclic phosphodiesterase 9A
Name:High affinity cGMP-specific 3',5'-cyclic phosphodiesterase 9A
Type:Protein
Mol. Mass.:68488.40
Organism:Homo sapiens (Human)
Description:O76083
Residue:593
BDBM130498
NameBDBM130498
Synonyms:US8822479, 2
TypeSmall organic molecule
Emp. Form.C19H22N4O
Mol. Mass.322.4042
SMILESCc1cccc(c1C)-n1ncc2c1nc(CC1CCCC1)[nH]c2=O