Reaction Details
TargetHigh affinity cGMP-specific 3',5'-cyclic phosphodiesterase 9A
LigandBDBM130504
Substrate/Competitorn/a
Meas. Tech.Inhibition Assay
pH7.5±n/a
IC50 30±n/a nM
Commentsextracted
Citation Hendrix, MBärfacker, LErb, CHafner, FHeckroth, HKarthaus, DTersteegen, Avan der Staay, Fvan Kampen, M 6-cyclylmethyl-and 6-alkylmethyl-substituted pyrazolepyrimidines US Patent US8822479 Publication Date 9/2/2014
 
High affinity cGMP-specific 3',5'-cyclic phosphodiesterase 9A
Name:High affinity cGMP-specific 3',5'-cyclic phosphodiesterase 9A
Type:Protein
Mol. Mass.:68488.40
Organism:Homo sapiens (Human)
Description:O76083
Residue:593
BDBM130504
NameBDBM130504
Synonyms:US8822479, 39-1
TypeSmall organic molecule
Emp. Form.C16H19N5O
Mol. Mass.297.355
SMILESCCC(C)Cc1nc2n(ncc2c(=O)[nH]1)-c1cnccc1C