Reaction Details
TargetC-C chemokine receptor type 2
LigandBDBM130511
Substrate/Competitorn/a
Meas. Tech.Binding Assay
IC50 2±n/a nM
Citation Winters, MPFawzy, NEKang, FSui, Z Fused cyclopentyl antagonists of CCR2 US Patent US8822460 Publication Date 9/2/2014
 
C-C chemokine receptor type 2
Name:C-C chemokine receptor type 2
Type:Enzyme
Mol. Mass.:41932.32
Organism:Homo sapiens (Human)
Description:P41597
Residue:374
BDBM130511
NameBDBM130511
Synonyms:US8822460, 7 | US8822460, 9
TypeSmall organic molecule
Emp. Form.C24H31F3N2O4
Mol. Mass.468.5091
SMILESCOC1COCCC1NC1CC2OCCC2(C1)C(=O)N1CCc2ccc(cc2C1)C(F)(F)F