Reaction Details
TargetC-C chemokine receptor type 2
LigandBDBM130515
Substrate/Competitorn/a
Meas. Tech.Binding Assay
IC50 4±n/a nM
Citation Winters, MPFawzy, NEKang, FSui, Z Fused cyclopentyl antagonists of CCR2 US Patent US8822460 Publication Date 9/2/2014
 
C-C chemokine receptor type 2
Name:C-C chemokine receptor type 2
Type:Enzyme
Mol. Mass.:41932.32
Organism:Homo sapiens (Human)
Description:P41597
Residue:374
BDBM130515
NameBDBM130515
Synonyms:US8822460, 11
TypeSmall organic molecule
Emp. Form.C25H34F3N3O4
Mol. Mass.497.5504
SMILESCCC1CC2(CC(CC2O1)NC1CCOCC1OC)C(=O)N1CCc2ncc(cc2C1)C(F)(F)F