Reaction Details
TargetHigh affinity cGMP-specific 3',5'-cyclic phosphodiesterase 9A
LigandBDBM8366
Substrate/Competitorn/a
Meas. Tech.Inhibition Assay
pH8±n/a
IC50 30±n/a nM
Commentsextracted
Citation Kaizawa, HYamamoto, HKamijo, KSugita, MSeo, RYamamoto, SUkai, A Pyrazoloquinoline compound US Patent US8822448 Publication Date 9/2/2014
 
High affinity cGMP-specific 3',5'-cyclic phosphodiesterase 9A
Name:High affinity cGMP-specific 3',5'-cyclic phosphodiesterase 9A
Type:Enzyme
Mol. Mass.:61749.01
Organism:Rattus norvegicus (Rat)
Description:Q8QZV1
Residue:534
BDBM8366
NameBDBM8366
Synonyms:CHEMBL1809169 US9771375, Example 147
Typen/a
Emp. Form.C20H21N3S
Mol. Mass.335.466
SMILESCSc1nn(-c2cccc(C)c2)c2cc(ccc12)C1=CCNCC1