Reaction Details
TargetHigh affinity cGMP-specific 3',5'-cyclic phosphodiesterase 9A
LigandBDBM130794
Substrate/Competitorn/a
Meas. Tech.Inhibition Assay
pH8±n/a
IC50 2±n/a nM
Commentsextracted
Citation Kaizawa, HYamamoto, HKamijo, KSugita, MSeo, RYamamoto, SUkai, A Pyrazoloquinoline compound US Patent US8822448 Publication Date 9/2/2014
 
High affinity cGMP-specific 3',5'-cyclic phosphodiesterase 9A
Name:High affinity cGMP-specific 3',5'-cyclic phosphodiesterase 9A
Type:Enzyme
Mol. Mass.:61749.01
Organism:Rattus norvegicus (Rat)
Description:Q8QZV1
Residue:534
BDBM130794
NameBDBM130794
Synonyms:US8822448, 648
TypeSmall organic molecule
Emp. Form.C26H35N5O3
Mol. Mass.465.5878
SMILESCOCCCN1CCN(C[C@@H]1C)C(=O)c1cc2c3n(CC4CCC4)ncc3c(=O)[nH]c2cc1C