Reaction Details
TargetFibroblast growth factor receptor 1
LigandBDBM130859
Substrate/Competitorn/a
Meas. Tech.Enzyme Inhibition Assay
IC50 0.32±n/a nM
Citation Taka, NOhmori, MTakami, KMatsushita, MHayase, THyodo, IKochi, MNishii, HEbiike, HNakanishi, YMio, TWang, LZhao, W Aminopyrazole derivative US Patent US8829199 Publication Date 9/9/2014
 
Fibroblast growth factor receptor 1
Name:Fibroblast growth factor receptor 1
Type:Receptor
Mol. Mass.:91861.70
Organism:Homo sapiens (Human)
Description:P11362
Residue:822
BDBM130859
NameBDBM130859
Synonyms:US8829199, 114
TypeSmall organic molecule
Emp. Form.C27H28N7O
Mol. Mass.466.5575
SMILESCC1CCC(C)N1Cc1ccc2[nH]c(cc2c1)C(=O)c1cnn(c1N)-c1ccc2nc(C)nc2c1