Reaction Details
TargetProto-oncogene tyrosine-protein kinase ROS
LigandBDBM130910
Substrate/Competitorn/a
Meas. Tech.In Vitro Kinase Activity Assay
pH7.5±n/a
IC50 0.3±n/a nM
Commentsextracted
Citation Gregor, VE Tyrosine kinase inhibitors US Patent US8822500 Publication Date 9/2/2014
 
Proto-oncogene tyrosine-protein kinase ROS
Name:Proto-oncogene tyrosine-protein kinase ROS
Type:Enzyme
Mol. Mass.:263897.39
Organism:Homo sapiens (Human)
Description:P08922
Residue:2347
BDBM130910
NameBDBM130910
Synonyms:US8822500, [4]
TypeSmall organic molecule
Emp. Form.C29H28F4N6O2
Mol. Mass.568.5652
SMILESC[C@@H](Cc1c(F)c(F)cc(F)c1F)Nc1cc[nH]c(=O)c1-c1nc2cc3C(=O)N(Cc3cc2[nH]1)C1CCN(C)CC1