Reaction Details
TargetProto-oncogene tyrosine-protein kinase ROS
LigandBDBM130921
Substrate/Competitorn/a
Meas. Tech.In Vitro Kinase Activity Assay
pH7.5±n/a
IC50 2.365±n/a nM
Commentsextracted
Citation Gregor, VE Tyrosine kinase inhibitors US Patent US8822500 Publication Date 9/2/2014
 
Proto-oncogene tyrosine-protein kinase ROS
Name:Proto-oncogene tyrosine-protein kinase ROS
Type:Enzyme
Mol. Mass.:263897.39
Organism:Homo sapiens (Human)
Description:P08922
Residue:2347
BDBM130921
NameBDBM130921
Synonyms:US8822500, [24A]
TypeSmall organic molecule
Emp. Form.C30H30F4N6O2
Mol. Mass.582.5918
SMILESCC(Cc1c(F)c(F)cc(F)c1F)Nc1cc[nH]c(=O)c1-c1nc2c(C)c3CN(C4CCN(C)CC4)C(=O)c3cc2[nH]1