Reaction Details
TargetcAMP-specific 3',5'-cyclic phosphodiesterase 4A
LigandBDBM130931
Substrate/Competitorn/a
Meas. Tech.Binding Assay
IC50 24±n/a nM
Citation Felding, JSørensen, MD Triazolopyridines as phosphodiesterase inhibitors for treatment of dermal diseases US Patent US8829190 Publication Date 9/9/2014
 
cAMP-specific 3',5'-cyclic phosphodiesterase 4A
Name:cAMP-specific 3',5'-cyclic phosphodiesterase 4A
Type:Enzyme
Mol. Mass.:98113.27
Organism:Homo sapiens (Human)
Description:P27815
Residue:886
BDBM130931
NameBDBM130931
Synonyms:US8829190, 109
TypeSmall organic molecule
Emp. Form.C22H21Cl2N5O4
Mol. Mass.490.339
SMILESCOc1ccc(C(=O)Cc2c(Cl)cncc2Cl)n2nc(nc12)C1(CC1)C(=O)N1CCOCC1