Reaction Details
TargetcAMP-specific 3',5'-cyclic phosphodiesterase 4A
LigandBDBM130933
Substrate/Competitorn/a
Meas. Tech.Binding Assay
IC50 0.3±n/a nM
Citation Felding, JSørensen, MD Triazolopyridines as phosphodiesterase inhibitors for treatment of dermal diseases US Patent US8829190 Publication Date 9/9/2014
 
cAMP-specific 3',5'-cyclic phosphodiesterase 4A
Name:cAMP-specific 3',5'-cyclic phosphodiesterase 4A
Type:Enzyme
Mol. Mass.:98113.27
Organism:Homo sapiens (Human)
Description:P27815
Residue:886
BDBM130933
NameBDBM130933
Synonyms:US8829190, 111
TypeSmall organic molecule
Emp. Form.C21H21Cl2N5O3
Mol. Mass.462.329
SMILESCCCNC(=O)C1(CC1)c1nc2c(OC)ccc(C(=O)Cc3c(Cl)cncc3Cl)n2n1