Reaction Details
TargetcAMP-specific 3',5'-cyclic phosphodiesterase 4A
LigandBDBM130940
Substrate/Competitorn/a
Meas. Tech.Binding Assay
IC50 3±n/a nM
Citation Felding, JSørensen, MD Triazolopyridines as phosphodiesterase inhibitors for treatment of dermal diseases US Patent US8829190 Publication Date 9/9/2014
 
cAMP-specific 3',5'-cyclic phosphodiesterase 4A
Name:cAMP-specific 3',5'-cyclic phosphodiesterase 4A
Type:Enzyme
Mol. Mass.:98113.27
Organism:Homo sapiens (Human)
Description:P27815
Residue:886
BDBM130940
NameBDBM130940
Synonyms:US8829190, 118
TypeSmall organic molecule
Emp. Form.C18H15Cl2N5O3
Mol. Mass.420.249
SMILESCOc1ccc(C(=O)Cc2c(Cl)cncc2Cl)n2nc(nc12)C1(CC1)C(N)=O