Reaction Details
TargetcAMP-specific 3',5'-cyclic phosphodiesterase 4A
LigandBDBM130946
Substrate/Competitorn/a
Meas. Tech.Binding Assay
IC50 52±n/a nM
Citation Felding, JSørensen, MD Triazolopyridines as phosphodiesterase inhibitors for treatment of dermal diseases US Patent US8829190 Publication Date 9/9/2014
 
cAMP-specific 3',5'-cyclic phosphodiesterase 4A
Name:cAMP-specific 3',5'-cyclic phosphodiesterase 4A
Type:Enzyme
Mol. Mass.:98113.27
Organism:Homo sapiens (Human)
Description:P27815
Residue:886
BDBM130946
NameBDBM130946
Synonyms:US8829190, 124
TypeSmall organic molecule
Emp. Form.C18H17BrN4O3
Mol. Mass.417.257
SMILESCOc1ccc(C(=O)Cc2ccncc2Br)n2nc(nc12)C1(CO)CC1