Reaction Details
TargetcAMP-specific 3',5'-cyclic phosphodiesterase 4A
LigandBDBM130947
Substrate/Competitorn/a
Meas. Tech.Binding Assay
IC50 3100±n/a nM
Citation Felding, JSørensen, MD Triazolopyridines as phosphodiesterase inhibitors for treatment of dermal diseases US Patent US8829190 Publication Date 9/9/2014
 
cAMP-specific 3',5'-cyclic phosphodiesterase 4A
Name:cAMP-specific 3',5'-cyclic phosphodiesterase 4A
Type:Enzyme
Mol. Mass.:98113.27
Organism:Homo sapiens (Human)
Description:P27815
Residue:886
BDBM130947
NameBDBM130947
Synonyms:US8829190, 125
TypeSmall organic molecule
Emp. Form.C19H17N5O3
Mol. Mass.363.37
SMILESCOc1ccc(C(=O)Cc2ccnc(c2)C#N)n2nc(nc12)C1(CO)CC1