Reaction Details
TargetHigh affinity cGMP-specific 3',5'-cyclic phosphodiesterase 9A
LigandBDBM131014
Substrate/Competitorn/a
Meas. Tech.Inhibition Assay
Temperature303.15±n/a K
IC50 2±n/a nM
Commentsextracted
Citation Okada, MSato, SKawade, KGotanda, KShinbo, ANakano, YKobayashi, H Substituted imidazo[1,5-A]quinoxalines as phosphodiesterase 9 inhibitors US Patent US8829000 Publication Date 9/9/2014
 
High affinity cGMP-specific 3',5'-cyclic phosphodiesterase 9A
Name:High affinity cGMP-specific 3',5'-cyclic phosphodiesterase 9A
Type:Protein
Mol. Mass.:68488.40
Organism:Homo sapiens (Human)
Description:O76083
Residue:593
BDBM131014
NameBDBM131014
Synonyms:US8829000, 187
TypeSmall organic molecule
Emp. Form.C14H10F3N3O3
Mol. Mass.325.2427
SMILESOC(=O)CCc1ncc2n1c1ccc(cc1[nH]c2=O)C(F)(F)F